Reaction Details
TargetBcl-2-like protein 1
LigandBDBM50357759
Substrate/Competitorn/a
Meas. Tech.ChEMBL_785940 (CHEMBL1921340)
Ki 7.8±n/a nM
Citation Goreshnik, IBrock, AMMaly, DJ Biochemical and pharmacological profiling of the pro-survival protein Bcl-xL. Bioorg Med Chem Lett21:4951-5 (2011) 
 
Bcl-2-like protein 1
Name:Bcl-2-like protein 1
Type:Mitochondrion membrane; Single-pass membrane protein
Mol. Mass.:26039.60
Organism:Homo sapiens (Human)
Description:n/a
Residue:233
BDBM50357759
NameBDBM50357759
Synonyms:CHEMBL1916197
TypeSmall organic molecule
Emp. Form.C108H170N32O31S
Mol. Mass.2444.766
SMILESCC[C@H](C)[C@H](NC(=O)[C@H](CCCN=C(N)N)NC(=O)[C@H](CCCN=C(N)N)NC(=O)[C@H](CC(C)C)NC(=O)[C@H](CCC(O)=O)NC(=O)[C@H](CCC(N)=O)NC(=O)[C@H](C)NC(=O)[C@@H](NC(=O)[C@H](Cc1c[nH]c2ccccc12)NC(=O)[C@@H](NC(=O)[C@H](CCC(O)=O)NC(=O)[C@@H]1CCCN1C(=O)[C@H](CCCN=C(N)N)NC(=O)[C@@H](N)CCSC)[C@@H](C)CC)[C@@H](C)CC)C(=O)NCC(=O)N[C@@H](CC(O)=O)C(=O)N[C@@H](CCC(O)=O)C(=O)N[C@@H](Cc1ccccc1)C(=O)N[C@@H](CC(N)=O)C(=O)N[C@@H](C)C(O)=O