Reaction Details
TargetInduced myeloid leukemia cell differentiation protein Mcl-1 homolog
LigandBDBM21447
Substrate/Competitorn/a
Meas. Tech.ChEMBL_785797 (CHEMBL1920920)
Kd>1000±n/a nM
Citation Goreshnik, IBrock, AMMaly, DJ Biochemical and pharmacological profiling of the pro-survival protein Bcl-xL. Bioorg Med Chem Lett21:4951-5 (2011) 
 
Induced myeloid leukemia cell differentiation protein Mcl-1 homolog
Name:Induced myeloid leukemia cell differentiation protein Mcl-1 homolog
Type:Developmental protein
Mol. Mass.:35215.08
Organism:Mus musculus (Mouse)
Description:n/a
Residue:331
BDBM21447
NameBDBM21447
Synonyms:4-(4-{[2-(4-chlorophenyl)phenyl]methyl}piperazin-1-yl)-N-[(4-{[(2R)-4-(dimethylamino)-1-(phenylsulfanyl)butan-2-yl]amino}-3-nitrobenzene)sulfonyl]benzamide CHEMBL376408 US11760752, Compound ABT-737 | US9125913, ABT-737
TypeSmall organic molecule
Emp. Form.C42H45ClN6O5S2
Mol. Mass.813.427
SMILESCN(C)CC[C@H](CSc1ccccc1)Nc1ccc(cc1[N+]([O-])=O)S(=O)(=O)NC(=O)c1ccc(cc1)N1CCN(Cc2ccccc2-c2ccc(Cl)cc2)CC1