Reaction Details
TargetSphingosine 1-phosphate receptor 1
LigandBDBM50357773
Substrate/Competitorn/a
Meas. Tech.ChEMBL_786287 (CHEMBL1920392)
EC50 24±n/a nM
Citation Buzard, DHan, SThoresen, LMoody, JLopez, LKawasaki, ASchrader, TSage, CGao, YEdwards, JBarden, JThatte, JFu, LSolomon, MLiu, LAl-Shamma, HGatlin, JLe, MXing, CEspinola, SJones, RM Discovery and characterization of potent and selective 4-oxo-4-(5-(5-phenyl-1,2,4-oxadiazol-3-yl)indolin-1-yl)butanoic acids as S1P¿? agonists. Bioorg Med Chem Lett21:6013-8 (2011) 
 
Sphingosine 1-phosphate receptor 1
Name:Sphingosine 1-phosphate receptor 1
Type:Enzyme
Mol. Mass.:42836.02
Organism:Homo sapiens (Human)
Description:P21453
Residue:382
BDBM50357773
NameBDBM50357773
Synonyms:CHEMBL1916410
TypeSmall organic molecule
Emp. Form.C16H11F6N5O
Mol. Mass.403.2819
SMILESFC(F)(F)c1cc(cc(c1)C(F)(F)F)-c1nc(no1)N1CCc2[nH]ncc2C1