Reaction Details
TargetSphingosine 1-phosphate receptor 1
LigandBDBM50357792
Substrate/Competitorn/a
Meas. Tech.ChEMBL_786287 (CHEMBL1920392)
EC50 1.1±n/a nM
Citation Buzard, DHan, SThoresen, LMoody, JLopez, LKawasaki, ASchrader, TSage, CGao, YEdwards, JBarden, JThatte, JFu, LSolomon, MLiu, LAl-Shamma, HGatlin, JLe, MXing, CEspinola, SJones, RM Discovery and characterization of potent and selective 4-oxo-4-(5-(5-phenyl-1,2,4-oxadiazol-3-yl)indolin-1-yl)butanoic acids as S1P¿? agonists. Bioorg Med Chem Lett21:6013-8 (2011) 
 
Sphingosine 1-phosphate receptor 1
Name:Sphingosine 1-phosphate receptor 1
Type:Enzyme
Mol. Mass.:42836.02
Organism:Homo sapiens (Human)
Description:P21453
Residue:382
BDBM50357792
NameBDBM50357792
Synonyms:CHEMBL1916569
TypeSmall organic molecule
Emp. Form.C24H22N4O5
Mol. Mass.446.4553
SMILESCC(C)Oc1cc(ccc1C#N)-c1nc(no1)-c1ccc2N(CCc2c1)C(=O)CCC(O)=O