Reaction Details
TargetSphingosine 1-phosphate receptor 5
LigandBDBM50357781
Substrate/Competitorn/a
Meas. Tech.ChEMBL_786297 (CHEMBL1920402)
EC50 88±n/a nM
Citation Buzard, DHan, SThoresen, LMoody, JLopez, LKawasaki, ASchrader, TSage, CGao, YEdwards, JBarden, JThatte, JFu, LSolomon, MLiu, LAl-Shamma, HGatlin, JLe, MXing, CEspinola, SJones, RM Discovery and characterization of potent and selective 4-oxo-4-(5-(5-phenyl-1,2,4-oxadiazol-3-yl)indolin-1-yl)butanoic acids as S1P¿? agonists. Bioorg Med Chem Lett21:6013-8 (2011) 
 
Sphingosine 1-phosphate receptor 5
Name:Sphingosine 1-phosphate receptor 5
Type:G Protein-Coupled Receptor (GPCR)
Mol. Mass.:41796.42
Organism:Homo sapiens (Human)
Description:n/a
Residue:398
BDBM50357781
NameBDBM50357781
Synonyms:CHEMBL1916559
TypeSmall organic molecule
Emp. Form.C22H15F6N3O4
Mol. Mass.499.3626
SMILESOC(=O)CCC(=O)N1CCc2cc(ccc12)-c1noc(n1)-c1cc(cc(c1)C(F)(F)F)C(F)(F)F