Reaction Details
TargetHigh affinity cAMP-specific and IBMX-insensitive 3',5'-cyclic phosphodiesterase 8A
LigandBDBM50357863
Substrate/Competitorn/a
Meas. Tech.ChEMBL_787244 (CHEMBL1918966)
IC50>10000±n/a nM
Citation Malamas, MSNi, YErdei, JStange, HSchindler, RLankau, HJGrunwald, CFan, KYParris, KLangen, BEgerland, UHage, TMarquis, KLGrauer, SBrennan, JNavarra, RGraf, RHarrison, BLRobichaud, AKronbach, TPangalos, MNHoefgen, NBrandon, NJ Highly potent, selective, and orally active phosphodiesterase 10A inhibitors. J Med Chem54:7621-38 (2011) 
 
High affinity cAMP-specific and IBMX-insensitive 3',5'-cyclic phosphodiesterase 8A
Name:High affinity cAMP-specific and IBMX-insensitive 3',5'-cyclic phosphodiesterase 8A
Type:Enzyme Catalytic Domain
Mol. Mass.:93295.89
Organism:Homo sapiens (Human)
Description:Recombinant catalytic domain (M1-E829) of human PDE8A.
Residue:829
BDBM50357863
NameBDBM50357863
Synonyms:CHEMBL1916123
TypeSmall organic molecule
Emp. Form.C20H20N4O2
Mol. Mass.348.3984
SMILESCOc1cc(OC)c2nc(C)c3c(C)nc(-c4cnccc4C)n3c2c1