Reaction Details
TargetMitogen-activated protein kinase 14
LigandBDBM50357886
Substrate/Competitorn/a
Meas. Tech.ChEMBL_787640 (CHEMBL1918093)
IC50 68±n/a nM
Citation Lumeras, WVidal, LVidal, BBalagué, COrellana, AMaldonado, MDomínguez, MSegarra, VCaturla, F 1,7-Naphthyridine 1-oxides as novel potent and selective inhibitors of p38 mitogen activated protein kinase. J Med Chem54:7899-910 (2011) 
 
Mitogen-activated protein kinase 14
Name:Mitogen-activated protein kinase 14
Type:Serine/threonine-protein kinase
Mol. Mass.:41286.76
Organism:Homo sapiens (Human)
Description:Q16539
Residue:360
BDBM50357886
NameBDBM50357886
Synonyms:CHEMBL1916344
TypeSmall organic molecule
Emp. Form.C21H14F2N2O
Mol. Mass.348.3455
SMILESCc1ccccc1-c1[n+]([O-])ccc2c(ccnc12)-c1ccc(F)cc1F