Reaction Details
TargetMitogen-activated protein kinase 14
LigandBDBM50357890
Substrate/Competitorn/a
Meas. Tech.ChEMBL_787640 (CHEMBL1918093)
IC50 148±n/a nM
Citation Lumeras, WVidal, LVidal, BBalagué, COrellana, AMaldonado, MDomínguez, MSegarra, VCaturla, F 1,7-Naphthyridine 1-oxides as novel potent and selective inhibitors of p38 mitogen activated protein kinase. J Med Chem54:7899-910 (2011) 
 
Mitogen-activated protein kinase 14
Name:Mitogen-activated protein kinase 14
Type:Serine/threonine-protein kinase
Mol. Mass.:41286.76
Organism:Homo sapiens (Human)
Description:Q16539
Residue:360
BDBM50357890
NameBDBM50357890
Synonyms:CHEMBL1916347
TypeSmall organic molecule
Emp. Form.C22H16F2N2O
Mol. Mass.362.372
SMILESCc1cccc(C)c1-c1[n+]([O-])ccc2c(ccnc12)-c1ccc(F)cc1F