Reaction Details
TargetMitogen-activated protein kinase 14
LigandBDBM50357912
Substrate/Competitorn/a
Meas. Tech.ChEMBL_787640 (CHEMBL1918093)
IC50 11±n/a nM
Citation Lumeras, WVidal, LVidal, BBalagué, COrellana, AMaldonado, MDomínguez, MSegarra, VCaturla, F 1,7-Naphthyridine 1-oxides as novel potent and selective inhibitors of p38 mitogen activated protein kinase. J Med Chem54:7899-910 (2011) 
 
Mitogen-activated protein kinase 14
Name:Mitogen-activated protein kinase 14
Type:Serine/threonine-protein kinase
Mol. Mass.:41286.76
Organism:Homo sapiens (Human)
Description:Q16539
Residue:360
BDBM50357912
NameBDBM50357912
Synonyms:CHEMBL1916526
TypeSmall organic molecule
Emp. Form.C24H18ClF2N3O2
Mol. Mass.453.868
SMILES[O-][n+]1ccc2c(cc(nc2c1-c1c(F)cccc1F)N1CCOCC1)-c1ccccc1Cl