Reaction Details
TargetAcetylcholinesterase
LigandBDBM50357943
Substrate/Competitorn/a
Meas. Tech.ChEMBL_787092 (CHEMBL1918659)
Ki 621±n/a nM
Citation Martins, CCarreiras, MCLeón, Rde los Ríos, CBartolini, MAndrisano, VIriepa, IMoraleda, IGálvez, EGarcía, MEgea, JSamadi, AChioua, MMarco-Contelles, J Synthesis and biological assessment of diversely substituted furo[2,3-b]quinolin-4-amine and pyrrolo[2,3-b]quinolin-4-amine derivatives, as novel tacrine analogues. Eur J Med Chem46:6119-30 (2011) 
 
Acetylcholinesterase
Name:Acetylcholinesterase
Type:Enzyme
Mol. Mass.:71812.79
Organism:Electrophorus electricus (Electric eel)
Description:n/a
Residue:633
BDBM50357943
NameBDBM50357943
Synonyms:CHEMBL1916768
TypeSmall organic molecule
Emp. Form.C23H21N3
Mol. Mass.339.4329
SMILESNc1c2CCCCc2nc2n(c(cc12)-c1ccccc1)-c1ccccc1