Reaction Details
TargetAmine oxidase [flavin-containing] B
LigandBDBM50358044
Substrate/Competitorn/a
Meas. Tech.ChEMBL_786918 (CHEMBL1920032)
Ki 160±n/a nM
Citation Reniers, JMeinguet, CMoineaux, LMasereel, BVincent, SPFrederick, RWouters, J Synthesis and inhibition study of monoamine oxidase, indoleamine 2,3-dioxygenase and tryptophan 2,3-dioxygenase by 3,8-substituted 5H-indeno[1,2-c]pyridazin-5-one derivatives. Eur J Med Chem46:6104-11 (2011) 
 
Amine oxidase [flavin-containing] B
Name:Amine oxidase [flavin-containing] B
Type:Protein
Mol. Mass.:58768.76
Organism:Homo sapiens (Human)
Description:P27338
Residue:520
BDBM50358044
NameBDBM50358044
Synonyms:CHEMBL1917940
TypeSmall organic molecule
Emp. Form.C19H13ClN2O2
Mol. Mass.336.772
SMILESCc1cc2C(=O)c3ccc(OCc4cccc(Cl)c4)cc3-c2nn1