Reaction Details
TargetCalpain-2 catalytic subunit
LigandBDBM50358148
Substrate/Competitorn/a
Meas. Tech.ChEMBL_788735 (CHEMBL1924666)
IC50 280±n/a nM
Citation Stuart, BGCoxon, JMMorton, JDAbell, ADMcDonald, DQAitken, SGJones, MABickerstaffe, R Molecular modeling: a search for a calpain inhibitor as a new treatment for cataractogenesis. J Med Chem54:7503-22 (2011) 
 
Calpain-2 catalytic subunit
Name:Calpain-2 catalytic subunit
Type:Protein
Mol. Mass.:79965.18
Organism:Homo sapiens (Human)
Description:n/a
Residue:700
BDBM50358148
NameBDBM50358148
Synonyms:CHEMBL1921825
TypeSmall organic molecule
Emp. Form.C26H32FN3O6S
Mol. Mass.533.612
SMILESCC(C)[C@@H]1NC(=O)[C@H](Cc2ccc(OCCCC[C@H](NC1=O)C=O)cc2)NS(=O)(=O)c1ccc(F)cc1