Reaction Details
TargetCalpain-2 catalytic subunit
LigandBDBM50358151
Substrate/Competitorn/a
Meas. Tech.ChEMBL_788735 (CHEMBL1924666)
IC50 31000±n/a nM
Citation Stuart, BGCoxon, JMMorton, JDAbell, ADMcDonald, DQAitken, SGJones, MABickerstaffe, R Molecular modeling: a search for a calpain inhibitor as a new treatment for cataractogenesis. J Med Chem54:7503-22 (2011) 
 
Calpain-2 catalytic subunit
Name:Calpain-2 catalytic subunit
Type:Protein
Mol. Mass.:79965.18
Organism:Homo sapiens (Human)
Description:n/a
Residue:700
BDBM50358151
NameBDBM50358151
Synonyms:CHEMBL1921828
TypeSmall organic molecule
Emp. Form.C28H37N3O6
Mol. Mass.511.6099
SMILESCC(C)C[C@@H]1NC(=O)[C@H](Cc2ccc(OCCC[C@@H](CO)NC1=O)cc2)NC(=O)OCc1ccccc1