Reaction Details
TargetMu-type opioid receptor
LigandBDBM50130563
Substrate/Competitorn/a
Meas. Tech.ChEMBL_788808 (CHEMBL1924793)
Ki 12±n/a nM
Citation Mitch, CHQuimby, SJDiaz, NPedregal, Cde la Torre, MGJimenez, AShi, QCanada, EJKahl, SDStatnick, MAMcKinzie, DLBenesh, DRRash, KSBarth, VN Discovery of aminobenzyloxyarylamides as¿ opioid receptor selective antagonists: application to preclinical development of a¿ opioid receptor antagonist receptor occupancy tracer. J Med Chem54:8000-12 (2011) 
 
Mu-type opioid receptor
Name:Mu-type opioid receptor
Type:G Protein-Coupled Receptor (GPCR)
Mol. Mass.:44789.51
Organism:Homo sapiens (Human)
Description:P35372
Residue:400
BDBM50130563
NameBDBM50130563
Synonyms:(3R)-7-Hydroxy-N-[(1S)-1-{[(3R,4R)-4-(3-hydroxyphenyl)-3,4-dimethyl-1-piperidinyl]methyl}-2-methylpropyl)-1,2,3,4-tetrahydro-3-isoquinolinecarboxamide (3R)-7-hydroxy-N-[(1S)-1-{[(3R,4R)-4-(3-hydroxyphenyl)-3,4-dimethyl-1-piperidinyl]methyl}-2-methylpropyl]-1,2,3,4-tetrahydro-3-isoquinolinecarboxamide 7-Hydroxy-1,2,3,4-tetrahydro-isoquinoline-3-carboxylic acid {(S)-1-[(3R,4R)-4-(3-hydroxy-phenyl)-3,4-dimethyl-piperidin-1-ylmethyl]-2-methyl-propyl}-amide CHEMBL415247 | atrans-(3R,4R)-dimethyl-4-(3-hydroxyphenyl) piperidine
TypeSmall organic molecule
Emp. Form.C28H39N3O3
Mol. Mass.465.6276
SMILESCC(C)[C@@H](CN1CC[C@](C)([C@@H](C)C1)c1cccc(O)c1)NC(=O)[C@H]1Cc2ccc(O)cc2CN1