Reaction Details
TargetDelta-type opioid receptor
LigandBDBM50358171
Substrate/Competitorn/a
Meas. Tech.ChEMBL_788809 (CHEMBL1924794)
Ki 166±n/a nM
Citation Mitch, CHQuimby, SJDiaz, NPedregal, Cde la Torre, MGJimenez, AShi, QCanada, EJKahl, SDStatnick, MAMcKinzie, DLBenesh, DRRash, KSBarth, VN Discovery of aminobenzyloxyarylamides as¿ opioid receptor selective antagonists: application to preclinical development of a¿ opioid receptor antagonist receptor occupancy tracer. J Med Chem54:8000-12 (2011) 
 
Delta-type opioid receptor
Name:Delta-type opioid receptor
Type:G Protein-Coupled Receptor (GPCR)
Mol. Mass.:40382.98
Organism:Homo sapiens (Human)
Description:Competition binding assays were carried out using membrane preparations from transfected HN9.10 cells that constitutively expressed the delta opioid receptor.
Residue:372
BDBM50358171
NameBDBM50358171
Synonyms:CHEMBL1921847
TypeSmall organic molecule
Emp. Form.C26H27FN2O2
Mol. Mass.418.5032
SMILESCc1cc(C)cc(c1)[C@@H]1CCCN1Cc1ccc(Oc2ccc(cc2F)C(N)=O)cc1