Reaction Details
TargetMu-type opioid receptor
LigandBDBM50358167
Substrate/Competitorn/a
Meas. Tech.ChEMBL_788808 (CHEMBL1924793)
Ki>500±n/a nM
Citation Mitch, CHQuimby, SJDiaz, NPedregal, Cde la Torre, MGJimenez, AShi, QCanada, EJKahl, SDStatnick, MAMcKinzie, DLBenesh, DRRash, KSBarth, VN Discovery of aminobenzyloxyarylamides as¿ opioid receptor selective antagonists: application to preclinical development of a¿ opioid receptor antagonist receptor occupancy tracer. J Med Chem54:8000-12 (2011) 
 
Mu-type opioid receptor
Name:Mu-type opioid receptor
Type:G Protein-Coupled Receptor (GPCR)
Mol. Mass.:44789.51
Organism:Homo sapiens (Human)
Description:P35372
Residue:400
BDBM50358167
NameBDBM50358167
Synonyms:CHEMBL1921843
TypeSmall organic molecule
Emp. Form.C23H22ClN3O2
Mol. Mass.407.893
SMILESNC(=O)c1ccc(Oc2ccc(CN3CCC[C@@H]3c3cccnc3)cc2)c(Cl)c1