Reaction Details
TargetKappa-type opioid receptor
LigandBDBM50358169
Substrate/Competitorn/a
Meas. Tech.ChEMBL_788807 (CHEMBL1924792)
Ki 0.565000±n/a nM
Citation Mitch, CHQuimby, SJDiaz, NPedregal, Cde la Torre, MGJimenez, AShi, QCanada, EJKahl, SDStatnick, MAMcKinzie, DLBenesh, DRRash, KSBarth, VN Discovery of aminobenzyloxyarylamides as¿ opioid receptor selective antagonists: application to preclinical development of a¿ opioid receptor antagonist receptor occupancy tracer. J Med Chem54:8000-12 (2011) 
 
Kappa-type opioid receptor
Name:Kappa-type opioid receptor
Type:G Protein-Coupled Receptor (GPCR)
Mol. Mass.:42648.76
Organism:Homo sapiens (Human)
Description:P41145
Residue:380
BDBM50358169
NameBDBM50358169
Synonyms:CHEMBL1921845
TypeSmall organic molecule
Emp. Form.C24H22F2N2O2
Mol. Mass.408.4405
SMILESNC(=O)c1ccc(Oc2ccc(CN3CCC[C@H]3c3cccc(F)c3)cc2)c(F)c1