Reaction Details
TargetMetabotropic glutamate receptor 4
LigandBDBM55091
Substrate/Competitorn/a
Meas. Tech.ChEMBL_788856 (CHEMBL1924926)
EC50 435±n/a nM
Citation Jones, CKEngers, DWThompson, ADField, JRBlobaum, ALLindsley, SRZhou, YGogliotti, RDJadhav, SZamorano, RBogenpohl, JSmith, YMorrison, RDaniels, JSWeaver, CDConn, PJLindsley, CWNiswender, CMHopkins, CR Discovery, synthesis, and structure-activity relationship development of a series of N-4-(2,5-dioxopyrrolidin-1-yl)phenylpicolinamides (VU0400195, ML182): characterization of a novel positive allosteric modulator of the metabotropic glutamate receptor 4 (mGlu(4)) with oral efficacy in an antiparkin J Med Chem54:7639-47 (2011) 
 
Metabotropic glutamate receptor 4
Name:Metabotropic glutamate receptor 4
Type:Protein
Mol. Mass.:101899.95
Organism:Homo sapiens (Human)
Description:Q14833
Residue:912
BDBM55091
NameBDBM55091
Synonyms:N-[3-chloranyl-4-[(1S,5R)-6,6-dimethyl-2,4-bis(oxidanylidene)-3-azabicyclo[3.1.0]hexan-3-yl]phenyl]pyridine-2-carboxamide N-[3-chloro-4-[(1S,5R)-6,6-dimethyl-2,4-dioxo-3-azabicyclo[3.1.0]hexan-3-yl]phenyl]-2-pyridinecarboxamide VU0410425-1 | cid_46869949
TypeSmall organic molecule
Emp. Form.C19H16ClN3O3
Mol. Mass.369.802
SMILESCC1(C)c2c1c(O)n(c2O)-c1ccc(NC(=O)c2ccccn2)cc1Cl