Reaction Details
TargetCytochrome P450 1A2
LigandBDBM50358174
Substrate/Competitorn/a
Meas. Tech.ChEMBL_788860 (CHEMBL1924930)
IC50>30000±n/a nM
Citation Jones, CKEngers, DWThompson, ADField, JRBlobaum, ALLindsley, SRZhou, YGogliotti, RDJadhav, SZamorano, RBogenpohl, JSmith, YMorrison, RDaniels, JSWeaver, CDConn, PJLindsley, CWNiswender, CMHopkins, CR Discovery, synthesis, and structure-activity relationship development of a series of N-4-(2,5-dioxopyrrolidin-1-yl)phenylpicolinamides (VU0400195, ML182): characterization of a novel positive allosteric modulator of the metabotropic glutamate receptor 4 (mGlu(4)) with oral efficacy in an antiparkin J Med Chem54:7639-47 (2011) 
 
Cytochrome P450 1A2
Name:Cytochrome P450 1A2
Type:Enzyme
Mol. Mass.:58423.38
Organism:Homo sapiens (Human)
Description:P05177
Residue:516
BDBM50358174
NameBDBM50358174
Synonyms:CHEMBL1921855
TypeSmall organic molecule
Emp. Form.C18H13N3O5S2
Mol. Mass.415.443
SMILESO=C(Nc1ccc(cc1)N1S(=O)(=O)c2ccccc2S1(=O)=O)c1ccccn1