Reaction Details
TargetCytochrome P450 2D6
LigandBDBM50358179
Substrate/Competitorn/a
Meas. Tech.ChEMBL_788862 (CHEMBL1924932)
IC50>30000±n/a nM
Citation Jones, CKEngers, DWThompson, ADField, JRBlobaum, ALLindsley, SRZhou, YGogliotti, RDJadhav, SZamorano, RBogenpohl, JSmith, YMorrison, RDaniels, JSWeaver, CDConn, PJLindsley, CWNiswender, CMHopkins, CR Discovery, synthesis, and structure-activity relationship development of a series of N-4-(2,5-dioxopyrrolidin-1-yl)phenylpicolinamides (VU0400195, ML182): characterization of a novel positive allosteric modulator of the metabotropic glutamate receptor 4 (mGlu(4)) with oral efficacy in an antiparkin J Med Chem54:7639-47 (2011) 
 
Cytochrome P450 2D6
Name:Cytochrome P450 2D6
Type:Protein
Mol. Mass.:55774.82
Organism:Homo sapiens (Human)
Description:P10635
Residue:497
BDBM50358179
NameBDBM50358179
Synonyms:CHEMBL1921961
TypeSmall organic molecule
Emp. Form.C21H16ClN3O3
Mol. Mass.393.823
SMILESOc1c2[C@H]3C[C@H](C=C3)c2c(O)n1-c1ccc(NC(=O)c2ccccn2)cc1Cl