Reaction Details
TargetCytochrome P450 2D6
LigandBDBM55094
Substrate/Competitorn/a
Meas. Tech.ChEMBL_788862 (CHEMBL1924932)
IC50>30000±n/a nM
Citation Jones, CKEngers, DWThompson, ADField, JRBlobaum, ALLindsley, SRZhou, YGogliotti, RDJadhav, SZamorano, RBogenpohl, JSmith, YMorrison, RDaniels, JSWeaver, CDConn, PJLindsley, CWNiswender, CMHopkins, CR Discovery, synthesis, and structure-activity relationship development of a series of N-4-(2,5-dioxopyrrolidin-1-yl)phenylpicolinamides (VU0400195, ML182): characterization of a novel positive allosteric modulator of the metabotropic glutamate receptor 4 (mGlu(4)) with oral efficacy in an antiparkin J Med Chem54:7639-47 (2011) 
 
Cytochrome P450 2D6
Name:Cytochrome P450 2D6
Type:Protein
Mol. Mass.:55774.82
Organism:Homo sapiens (Human)
Description:P10635
Residue:497
BDBM55094
NameBDBM55094
Synonyms:N-[3-chloro-4-(2,5-diketo-3-phenyl-pyrrolidino)phenyl]picolinamide N-[3-chloro-4-(2,5-dioxo-3-phenylpyrrolidin-1-yl)phenyl]pyridine-2-carboxamide VU0400071-3 | cid_45110765
TypeSmall organic molecule
Emp. Form.C22H16ClN3O3
Mol. Mass.405.834
SMILESOc1cc(c(O)n1-c1ccc(NC(=O)c2ccccn2)cc1Cl)-c1ccccc1