Reaction Details
TargetMetabotropic glutamate receptor 4
LigandBDBM55086
Substrate/Competitorn/a
Meas. Tech.ChEMBL_788856 (CHEMBL1924926)
EC50 59.4±n/a nM
Citation Jones, CKEngers, DWThompson, ADField, JRBlobaum, ALLindsley, SRZhou, YGogliotti, RDJadhav, SZamorano, RBogenpohl, JSmith, YMorrison, RDaniels, JSWeaver, CDConn, PJLindsley, CWNiswender, CMHopkins, CR Discovery, synthesis, and structure-activity relationship development of a series of N-4-(2,5-dioxopyrrolidin-1-yl)phenylpicolinamides (VU0400195, ML182): characterization of a novel positive allosteric modulator of the metabotropic glutamate receptor 4 (mGlu(4)) with oral efficacy in an antiparkin J Med Chem54:7639-47 (2011) 
 
Metabotropic glutamate receptor 4
Name:Metabotropic glutamate receptor 4
Type:Protein
Mol. Mass.:101899.95
Organism:Homo sapiens (Human)
Description:Q14833
Residue:912
BDBM55086
NameBDBM55086
Synonyms:N-(3-chloro-4-phthalimido-phenyl)picolinamide N-[3-chloro-4-(1,3-dioxoisoindol-2-yl)phenyl]pyridine-2-carboxamide VU0405622-1 | cid_45110131
TypeSmall organic molecule
Emp. Form.C20H12ClN3O3
Mol. Mass.377.781
SMILESClc1cc(NC(=O)c2ccccn2)ccc1N1C(=O)c2ccccc2C1=O