Reaction Details
TargetSerine/threonine-protein kinase mTOR
LigandBDBM50312606
Substrate/Competitorn/a
Meas. Tech.ChEMBL_790078 (CHEMBL1925468)
Ki 29±n/a nM
Citation Sutherlin, DPBao, LBerry, MCastanedo, GChuckowree, IDotson, JFolks, AFriedman, LGoldsmith, RGunzner, JHeffron, TLesnick, JLewis, CMathieu, SMurray, JNonomiya, JPang, JPegg, NPrior, WWRouge, LSalphati, LSampath, DTian, QTsui, VWan, NCWang, SWei, BWiesmann, CWu, PZhu, BYOlivero, A Discovery of a potent, selective, and orally available class I phosphatidylinositol 3-kinase (PI3K)/mammalian target of rapamycin (mTOR) kinase inhibitor (GDC-0980) for the treatment of cancer. J Med Chem54:7579-87 (2011) 
 
Serine/threonine-protein kinase mTOR
Name:Serine/threonine-protein kinase mTOR
Type:Rapamycin target protein
Mol. Mass.:288917.12
Organism:Homo sapiens (Human)
Description:P42345
Residue:2549
BDBM50312606
NameBDBM50312606
Synonyms:5-(6-((4-(methylsulfonyl)piperazin-1-yl)methyl)-4-morpholinothieno[3,2-d]pyrimidin-2-yl)pyrimidin-2-amine | CHEMBL1083192
TypeSmall organic molecule
Emp. Form.C20H26N8O3S2
Mol. Mass.490.602
SMILESCS(=O)(=O)N1CCN(Cc2cc3nc(nc(N4CCOCC4)c3s2)-c2cnc(N)nc2)CC1