Reaction Details
TargetMitogen-activated protein kinase 1
LigandBDBM50358234
Substrate/Competitorn/a
Meas. Tech.ChEMBL_790670 (CHEMBL1926123)
IC50>200000±n/a nM
Citation Wilson, SCAtrash, BBarlow, CEccles, SFischer, PMHayes, AKelland, LJackson, WJarman, MMirza, AMoreno, JNutley, BPRaynaud, FISheldrake, PWalton, MWestwood, RWhittaker, SWorkman, PMcDonald, E Design, synthesis and biological evaluation of 6-pyridylmethylaminopurines as CDK inhibitors. Bioorg Med Chem19:6949-65 (2011) 
 
Mitogen-activated protein kinase 1
Name:Mitogen-activated protein kinase 1
Type:Ser/Thr Protein Kinase
Mol. Mass.:41392.76
Organism:Homo sapiens (Human)
Description:P28482
Residue:360
BDBM50358234
NameBDBM50358234
Synonyms:CHEMBL1921805
TypeSmall organic molecule
Emp. Form.C20H29N7O
Mol. Mass.383.4906
SMILESCC[C@H](Nc1nc(NCc2ccccn2)c2ncn(C(C)C)c2n1)C(C)(C)O