Reaction Details
TargetAurora kinase B
LigandBDBM50358244
Substrate/Competitorn/a
Meas. Tech.ChEMBL_790769 (CHEMBL1926222)
IC50>100000±n/a nM
Citation Lai, DYu, Svan Ofwegen, LTotzke, FProksch, PLin, W 9,10-secosteroids, protein kinase inhibitors from the Chinese gorgonian Astrogorgia sp. Bioorg Med Chem19:6873-80 (2011) 
 
Aurora kinase B
Name:Aurora kinase B
Type:Protein
Mol. Mass.:39327.72
Organism:Homo sapiens (Human)
Description:Q96GD4
Residue:344
BDBM50358244
NameBDBM50358244
Synonyms:CALICOFEROL A
TypeSmall organic molecule
Emp. Form.C27H40O2
Mol. Mass.396.6053
SMILESCC(C)C\C=C\[C@@H](C)[C@H]1CC[C@H]2[C@H](CCc3cc(O)ccc3C)C(=O)CC[C@]12C