Reaction Details
TargetRAC-alpha serine/threonine-protein kinase
LigandBDBM50358246
Substrate/Competitorn/a
Meas. Tech.ChEMBL_790766 (CHEMBL1926219)
IC50>100000±n/a nM
Citation Lai, DYu, Svan Ofwegen, LTotzke, FProksch, PLin, W 9,10-secosteroids, protein kinase inhibitors from the Chinese gorgonian Astrogorgia sp. Bioorg Med Chem19:6873-80 (2011) 
 
RAC-alpha serine/threonine-protein kinase
Name:RAC-alpha serine/threonine-protein kinase
Type:Enzyme
Mol. Mass.:55681.25
Organism:Homo sapiens (Human)
Description:P31749
Residue:480
BDBM50358246
NameBDBM50358246
Synonyms:CHEMBL456936
TypeSmall organic molecule
Emp. Form.C27H42O2
Mol. Mass.398.6212
SMILESCC(C)CCC[C@@H](C)[C@H]1CC[C@H]2[C@H](CCc3cc(O)ccc3C)C(=O)CC[C@]12C