Reaction Details
TargetDual specificity mitogen-activated protein kinase kinase 1
LigandBDBM50358246
Substrate/Competitorn/a
Meas. Tech.ChEMBL_790773 (CHEMBL1926226)
IC50>100000±n/a nM
Citation Lai, DYu, Svan Ofwegen, LTotzke, FProksch, PLin, W 9,10-secosteroids, protein kinase inhibitors from the Chinese gorgonian Astrogorgia sp. Bioorg Med Chem19:6873-80 (2011) 
 
Dual specificity mitogen-activated protein kinase kinase 1
Name:Dual specificity mitogen-activated protein kinase kinase 1
Type:Other Protein Type
Mol. Mass.:43439.03
Organism:Homo sapiens (Human)
Description:Full-length human MEK-1 was generated by PCR and purified as a fusion protein from Escherichia coli lysates.
Residue:393
BDBM50358246
NameBDBM50358246
Synonyms:CHEMBL456936
TypeSmall organic molecule
Emp. Form.C27H42O2
Mol. Mass.398.6212
SMILESCC(C)CCC[C@@H](C)[C@H]1CC[C@H]2[C@H](CCc3cc(O)ccc3C)C(=O)CC[C@]12C