Reaction Details
TargetSerine/threonine-protein kinase Nek2
LigandBDBM50358245
Substrate/Competitorn/a
Meas. Tech.ChEMBL_790775 (CHEMBL1926228)
IC50>100000±n/a nM
Citation Lai, DYu, Svan Ofwegen, LTotzke, FProksch, PLin, W 9,10-secosteroids, protein kinase inhibitors from the Chinese gorgonian Astrogorgia sp. Bioorg Med Chem19:6873-80 (2011) 
 
Serine/threonine-protein kinase Nek2
Name:Serine/threonine-protein kinase Nek2
Type:Enzyme
Mol. Mass.:51776.96
Organism:Homo sapiens (Human)
Description:P51955
Residue:445
BDBM50358245
NameBDBM50358245
Synonyms:CHEMBL1922225
TypeSmall organic molecule
Emp. Form.C28H42O2
Mol. Mass.410.6319
SMILESCC(C)C(=C)CC[C@@H](C)[C@H]1CC[C@H]2[C@H](CCc3cc(O)ccc3C)C(=O)CC[C@]12C