Reaction Details
TargetSerine/threonine-protein kinase Nek2
LigandBDBM50358250
Substrate/Competitorn/a
Meas. Tech.ChEMBL_790775 (CHEMBL1926228)
IC50>100000±n/a nM
Citation Lai, DYu, Svan Ofwegen, LTotzke, FProksch, PLin, W 9,10-secosteroids, protein kinase inhibitors from the Chinese gorgonian Astrogorgia sp. Bioorg Med Chem19:6873-80 (2011) 
 
Serine/threonine-protein kinase Nek2
Name:Serine/threonine-protein kinase Nek2
Type:Enzyme
Mol. Mass.:51776.96
Organism:Homo sapiens (Human)
Description:P51955
Residue:445
BDBM50358250
NameBDBM50358250
Synonyms:CALICOFEROL B
TypeSmall organic molecule
Emp. Form.C27H44O3
Mol. Mass.416.6365
SMILESCC(C)CCC[C@@H](C)[C@H]1[C@@H](O)C[C@H]2[C@H](CCc3cc(O)ccc3C)[C@H](O)CC[C@]12C