Reaction Details
TargetSerine/threonine-protein kinase N1
LigandBDBM50358248
Substrate/Competitorn/a
Meas. Tech.ChEMBL_790779 (CHEMBL1926232)
IC50>100000±n/a nM
Citation Lai, DYu, Svan Ofwegen, LTotzke, FProksch, PLin, W 9,10-secosteroids, protein kinase inhibitors from the Chinese gorgonian Astrogorgia sp. Bioorg Med Chem19:6873-80 (2011) 
 
Serine/threonine-protein kinase N1
Name:Serine/threonine-protein kinase N1
Type:PROTEIN
Mol. Mass.:103928.39
Organism:Homo sapiens (Human)
Description:ChEMBL_1433150
Residue:942
BDBM50358248
NameBDBM50358248
Synonyms:CHEMBL456294
TypeSmall organic molecule
Emp. Form.C27H42O3
Mol. Mass.414.6206
SMILESCC(C)CCC[C@@H](C)[C@H]1[C@@H](O)C[C@H]2[C@H](CCc3cc(O)ccc3C)C(=O)CC[C@]12C