Reaction Details
TargetCoagulation factor X
LigandBDBM50358251
Substrate/Competitorn/a
Meas. Tech.ChEMBL_790790 (CHEMBL1926243)
Ki 20±n/a nM
Citation Hirayama, FKoshio, HIshihara, THachiya, SSugasawa, KKoga, YSeki, NShiraki, RShigenaga, TIwatsuki, YMoritani, YMori, KKadokura, TKawasaki, TMatsumoto, YSakamoto, STsukamoto, S Discovery of N-[2-hydroxy-6-(4-methoxybenzamido)phenyl]-4- (4-methyl-1,4-diazepan-1-yl)benzamide (darexaban, YM150) as a potent and orally available factor Xa inhibitor. J Med Chem54:8051-65 (2011) 
 
Coagulation factor X
Name:Coagulation factor X
Type:Enzyme
Mol. Mass.:54726.60
Organism:Homo sapiens (Human)
Description:n/a
Residue:488
BDBM50358251
NameBDBM50358251
Synonyms:CHEMBL1922344
TypeSmall organic molecule
Emp. Form.C33H38N4O10
Mol. Mass.650.6756
SMILESCOc1ccc(cc1)C(=O)Nc1cccc(O[C@@H]2O[C@@H]([C@@H](O)[C@H](O)[C@H]2O)C(O)=O)c1NC(=O)c1ccc(cc1)N1CCCN(C)CC1