Reaction Details
TargetCoagulation factor X
LigandBDBM50358260
Substrate/Competitorn/a
Meas. Tech.ChEMBL_790782 (CHEMBL1926235)
IC50 140±n/a nM
Citation Hirayama, FKoshio, HIshihara, THachiya, SSugasawa, KKoga, YSeki, NShiraki, RShigenaga, TIwatsuki, YMoritani, YMori, KKadokura, TKawasaki, TMatsumoto, YSakamoto, STsukamoto, S Discovery of N-[2-hydroxy-6-(4-methoxybenzamido)phenyl]-4- (4-methyl-1,4-diazepan-1-yl)benzamide (darexaban, YM150) as a potent and orally available factor Xa inhibitor. J Med Chem54:8051-65 (2011) 
 
Coagulation factor X
Name:Coagulation factor X
Type:Enzyme
Mol. Mass.:54726.60
Organism:Homo sapiens (Human)
Description:n/a
Residue:488
BDBM50358260
NameBDBM50358260
Synonyms:CHEMBL1922228
TypeSmall organic molecule
Emp. Form.C27H30N4O3
Mol. Mass.458.5521
SMILESCOc1ccc(NC(=O)c2ccccc2NC(=O)c2ccc(cc2)N2CCCN(C)CC2)cc1