Reaction Details
TargetCoagulation factor X
LigandBDBM50358262
Substrate/Competitorn/a
Meas. Tech.ChEMBL_790782 (CHEMBL1926235)
IC50 118±n/a nM
Citation Hirayama, FKoshio, HIshihara, THachiya, SSugasawa, KKoga, YSeki, NShiraki, RShigenaga, TIwatsuki, YMoritani, YMori, KKadokura, TKawasaki, TMatsumoto, YSakamoto, STsukamoto, S Discovery of N-[2-hydroxy-6-(4-methoxybenzamido)phenyl]-4- (4-methyl-1,4-diazepan-1-yl)benzamide (darexaban, YM150) as a potent and orally available factor Xa inhibitor. J Med Chem54:8051-65 (2011) 
 
Coagulation factor X
Name:Coagulation factor X
Type:Enzyme
Mol. Mass.:54726.60
Organism:Homo sapiens (Human)
Description:n/a
Residue:488
BDBM50358262
NameBDBM50358262
Synonyms:CHEMBL1922231
TypeSmall organic molecule
Emp. Form.C28H32N4O4
Mol. Mass.488.5781
SMILESCOc1ccc(cc1)C(=O)Nc1cc(OC)ccc1NC(=O)c1ccc(cc1)N1CCCN(C)CC1