Reaction Details
TargetCoagulation factor X
LigandBDBM50358273
Substrate/Competitorn/a
Meas. Tech.ChEMBL_790782 (CHEMBL1926235)
IC50 64.2±n/a nM
Citation Hirayama, FKoshio, HIshihara, THachiya, SSugasawa, KKoga, YSeki, NShiraki, RShigenaga, TIwatsuki, YMoritani, YMori, KKadokura, TKawasaki, TMatsumoto, YSakamoto, STsukamoto, S Discovery of N-[2-hydroxy-6-(4-methoxybenzamido)phenyl]-4- (4-methyl-1,4-diazepan-1-yl)benzamide (darexaban, YM150) as a potent and orally available factor Xa inhibitor. J Med Chem54:8051-65 (2011) 
 
Coagulation factor X
Name:Coagulation factor X
Type:Enzyme
Mol. Mass.:54726.60
Organism:Homo sapiens (Human)
Description:n/a
Residue:488
BDBM50358273
NameBDBM50358273
Synonyms:CHEMBL1922339
TypeSmall organic molecule
Emp. Form.C26H27ClN4O3
Mol. Mass.478.971
SMILESCN1CCCN(CC1)c1ccc(cc1)C(=O)Nc1c(O)cccc1NC(=O)c1ccc(Cl)cc1