Reaction Details
TargetReceptor-type tyrosine-protein kinase FLT3
LigandBDBM50358288
Substrate/Competitorn/a
Meas. Tech.ChEMBL_790947 (CHEMBL1925563)
IC50>10000±n/a nM
Citation Ryu, JWHan, SYYun, JIChoi, SUJung, HHa, JDCho, SYLee, COKang, NSKoh, JSKim, HRLee, J Design and synthesis of triazolopyridazines substituted with methylisoquinolinone as selective c-Met kinase inhibitors. Bioorg Med Chem Lett21:7185-8 (2011) 
 
Receptor-type tyrosine-protein kinase FLT3
Name:Receptor-type tyrosine-protein kinase FLT3
Type:Enzyme
Mol. Mass.:112888.62
Organism:Homo sapiens (Human)
Description:P36888
Residue:993
BDBM50358288
NameBDBM50358288
Synonyms:CHEMBL1922404
TypeSmall organic molecule
Emp. Form.C19H15N7O
Mol. Mass.357.3687
SMILESCn1cc(cn1)-c1ccc2nnc(Cc3cccc4c3cc[nH]c4=O)n2n1