Reaction Details
TargetHigh affinity nerve growth factor receptor
LigandBDBM50358288
Substrate/Competitorn/a
Meas. Tech.ChEMBL_790948 (CHEMBL1925564)
IC50>10000±n/a nM
Citation Ryu, JWHan, SYYun, JIChoi, SUJung, HHa, JDCho, SYLee, COKang, NSKoh, JSKim, HRLee, J Design and synthesis of triazolopyridazines substituted with methylisoquinolinone as selective c-Met kinase inhibitors. Bioorg Med Chem Lett21:7185-8 (2011) 
 
High affinity nerve growth factor receptor
Name:High affinity nerve growth factor receptor
Type:n/a
Mol. Mass.:87498.18
Organism:Homo sapiens (Human)
Description:P04629
Residue:796
BDBM50358288
NameBDBM50358288
Synonyms:CHEMBL1922404
TypeSmall organic molecule
Emp. Form.C19H15N7O
Mol. Mass.357.3687
SMILESCn1cc(cn1)-c1ccc2nnc(Cc3cccc4c3cc[nH]c4=O)n2n1