Reaction Details
Target5-hydroxytryptamine receptor 2B
LigandBDBM50358309
Substrate/Competitorn/a
Meas. Tech.ChEMBL_790999 (CHEMBL1925660)
Ki 5380±n/a nM
Citation Sato, SIwata, FYamada, SKawahara, HKatayama, M Usabamycins A-C: new anthramycin-type analogues from a marine-derived actinomycete. Bioorg Med Chem Lett21:7099-101 (2011) 
 
5-hydroxytryptamine receptor 2B
Name:5-hydroxytryptamine receptor 2B
Type:G Protein-Coupled Receptor (GPCR)
Mol. Mass.:54312.47
Organism:Homo sapiens (Human)
Description:Receptor binding assays were performed using human clone stably expressed in CHO cells.
Residue:481
BDBM50358309
NameBDBM50358309
Synonyms:CHEMBL1922538
TypeSmall organic molecule
Emp. Form.C15H18N2O2
Mol. Mass.258.3156
SMILESCOc1cccc2c1NC[C@@H]1C\C(CN1C2=O)=C/C