Reaction Details
TargetDiacylglycerol O-acyltransferase 1
LigandBDBM50358330
Substrate/Competitorn/a
Meas. Tech.ChEMBL_789309 (CHEMBL1924476)
IC50 100±n/a nM
Citation Yun, WAhmad, MChen, YGillespie, PConde-Knape, KKazmer, SLi, SQian, YTaub, RWertheimer, SJWhittard, TBolin, D Discovery and optimization of 2-phenyloxazole derivatives as diacylglycerol acyltransferase-1 inhibitors. Bioorg Med Chem Lett21:7205-9 (2011) 
 
Diacylglycerol O-acyltransferase 1
Name:Diacylglycerol O-acyltransferase 1
Type:Protein
Mol. Mass.:55297.82
Organism:Homo sapiens (Human)
Description:O75907
Residue:488
BDBM50358330
NameBDBM50358330
Synonyms:CHEMBL1922679
TypeSmall organic molecule
Emp. Form.C18H15F3N4O3S
Mol. Mass.424.397
SMILESFC(F)(F)c1oc(nc1C(=O)Nc1cnc(s1)N1CCOCC1)-c1ccccc1