Reaction Details
TargetDiacylglycerol O-acyltransferase 1
LigandBDBM50358339
Substrate/Competitorn/a
Meas. Tech.ChEMBL_789309 (CHEMBL1924476)
IC50 554±n/a nM
Citation Yun, WAhmad, MChen, YGillespie, PConde-Knape, KKazmer, SLi, SQian, YTaub, RWertheimer, SJWhittard, TBolin, D Discovery and optimization of 2-phenyloxazole derivatives as diacylglycerol acyltransferase-1 inhibitors. Bioorg Med Chem Lett21:7205-9 (2011) 
 
Diacylglycerol O-acyltransferase 1
Name:Diacylglycerol O-acyltransferase 1
Type:Protein
Mol. Mass.:55297.82
Organism:Homo sapiens (Human)
Description:O75907
Residue:488
BDBM50358339
NameBDBM50358339
Synonyms:CHEMBL1922688
TypeSmall organic molecule
Emp. Form.C19H17F3N4O3
Mol. Mass.406.3585
SMILESCN(CCO)c1ccc(NC(=O)c2nc(oc2C(F)(F)F)-c2ccccc2)cn1