Reaction Details
TargetGlucagon receptor
LigandBDBM50358360
Substrate/Competitorn/a
Meas. Tech.ChEMBL_789413 (CHEMBL1924335)
IC50 1.7±n/a nM
Citation Sinz, CChang, JLins, ARBrady, ECandelore, MDallas-Yang, QDing, VJiang, GLin, ZMock, SQureshi, SSalituro, GSaperstein, RShang, JSzalkowski, DTota, LVincent, SWright, MXu, SYang, XZhang, BTata, JKim, RParmee, E Discovery of cyclic guanidines as potent, orally active, human glucagon receptor antagonists. Bioorg Med Chem Lett21:7131-6 (2011) 
 
Glucagon receptor
Name:Glucagon receptor
Type:Enzyme
Mol. Mass.:54026.92
Organism:Homo sapiens (Human)
Description:P47871
Residue:477
BDBM50358360
NameBDBM50358360
Synonyms:CHEMBL1922708
TypeSmall organic molecule
Emp. Form.C29H26F6N8O2
Mol. Mass.632.5596
SMILESCCCCc1cc(cc2n(Cc3ccc(cc3)C(=O)Nc3nnn[nH]3)c(=Nc3ccc(OC(F)(F)F)cc3)n(C)c12)C(F)(F)F