Reaction Details
TargetCAI-1 autoinducer sensor kinase/phosphatase CqsS
LigandBDBM50358396
Substrate/Competitorn/a
Meas. Tech.ChEMBL_789525 (CHEMBL1924552)
EC50 210±n/a nM
Citation Bolitho, MEPerez, LJKoch, MJNg, WLBassler, BLSemmelhack, MF Small molecule probes of the receptor binding site in the Vibrio cholerae CAI-1 quorum sensing circuit. Bioorg Med Chem19:6906-18 (2011) 
 
CAI-1 autoinducer sensor kinase/phosphatase CqsS
Name:CAI-1 autoinducer sensor kinase/phosphatase CqsS
Type:PROTEIN
Mol. Mass.:78371.16
Organism:Vibrio cholerae serotype O1 (strain ATCC 39315 / El Tor Inaba N16961)
Description:ChEMBL_789528
Residue:686
BDBM50358396
NameBDBM50358396
Synonyms:CHEMBL1922866
TypeSmall organic molecule
Emp. Form.C13H27NO
Mol. Mass.213.3596
SMILESCCCCCCCCCC(=O)C(N)CC