Reaction Details
TargetCAI-1 autoinducer sensor kinase/phosphatase CqsS
LigandBDBM50358398
Substrate/Competitorn/a
Meas. Tech.ChEMBL_789525 (CHEMBL1924552)
EC50 2400±n/a nM
Citation Bolitho, MEPerez, LJKoch, MJNg, WLBassler, BLSemmelhack, MF Small molecule probes of the receptor binding site in the Vibrio cholerae CAI-1 quorum sensing circuit. Bioorg Med Chem19:6906-18 (2011) 
 
CAI-1 autoinducer sensor kinase/phosphatase CqsS
Name:CAI-1 autoinducer sensor kinase/phosphatase CqsS
Type:PROTEIN
Mol. Mass.:78371.16
Organism:Vibrio cholerae serotype O1 (strain ATCC 39315 / El Tor Inaba N16961)
Description:ChEMBL_789528
Residue:686
BDBM50358398
NameBDBM50358398
Synonyms:CHEMBL1922864
TypeSmall organic molecule
Emp. Form.C13H25BrO
Mol. Mass.277.241
SMILESCCCCCCCCCC(=O)C(Br)CC