Reaction Details
TargetReceptor tyrosine-protein kinase erbB-2
LigandBDBM50358440
Substrate/Competitorn/a
Meas. Tech.ChEMBL_789674 (CHEMBL1924800)
IC50 30±n/a nM
Citation Ishikawa, TSeto, MBanno, HKawakita, YOorui, MTaniguchi, TOhta, YTamura, TNakayama, AMiki, HKamiguchi, HTanaka, THabuka, NSogabe, SYano, JAertgeerts, KKamiyama, K Design and synthesis of novel human epidermal growth factor receptor 2 (HER2)/epidermal growth factor receptor (EGFR) dual inhibitors bearing a pyrrolo[3,2-d]pyrimidine scaffold. J Med Chem54:8030-50 (2011) 
 
Receptor tyrosine-protein kinase erbB-2
Name:Receptor tyrosine-protein kinase erbB-2
Type:n/a
Mol. Mass.:137894.47
Organism:Homo sapiens (Human)
Description:P04626
Residue:1255
BDBM50358440
NameBDBM50358440
Synonyms:CHEMBL1922905
TypeSmall organic molecule
Emp. Form.C19H12ClF3N4O
Mol. Mass.404.773
SMILESFC(F)(F)c1cccc(Oc2ccc(Nc3ncnc4cc[nH]c34)cc2Cl)c1