Reaction Details
TargetReceptor tyrosine-protein kinase erbB-2
LigandBDBM50358451
Substrate/Competitorn/a
Meas. Tech.ChEMBL_789674 (CHEMBL1924800)
IC50 4.1±n/a nM
Citation Ishikawa, TSeto, MBanno, HKawakita, YOorui, MTaniguchi, TOhta, YTamura, TNakayama, AMiki, HKamiguchi, HTanaka, THabuka, NSogabe, SYano, JAertgeerts, KKamiyama, K Design and synthesis of novel human epidermal growth factor receptor 2 (HER2)/epidermal growth factor receptor (EGFR) dual inhibitors bearing a pyrrolo[3,2-d]pyrimidine scaffold. J Med Chem54:8030-50 (2011) 
 
Receptor tyrosine-protein kinase erbB-2
Name:Receptor tyrosine-protein kinase erbB-2
Type:n/a
Mol. Mass.:137894.47
Organism:Homo sapiens (Human)
Description:P04626
Residue:1255
BDBM50358451
NameBDBM50358451
Synonyms:CHEMBL1923006
TypeSmall organic molecule
Emp. Form.C20H16Cl2N4O2
Mol. Mass.415.273
SMILESOCCn1ccc2ncnc(Nc3ccc(Oc4cccc(Cl)c4)c(Cl)c3)c12