Reaction Details
TargetReceptor tyrosine-protein kinase erbB-2
LigandBDBM50358455
Substrate/Competitorn/a
Meas. Tech.ChEMBL_789674 (CHEMBL1924800)
IC50 5.1±n/a nM
Citation Ishikawa, TSeto, MBanno, HKawakita, YOorui, MTaniguchi, TOhta, YTamura, TNakayama, AMiki, HKamiguchi, HTanaka, THabuka, NSogabe, SYano, JAertgeerts, KKamiyama, K Design and synthesis of novel human epidermal growth factor receptor 2 (HER2)/epidermal growth factor receptor (EGFR) dual inhibitors bearing a pyrrolo[3,2-d]pyrimidine scaffold. J Med Chem54:8030-50 (2011) 
 
Receptor tyrosine-protein kinase erbB-2
Name:Receptor tyrosine-protein kinase erbB-2
Type:n/a
Mol. Mass.:137894.47
Organism:Homo sapiens (Human)
Description:P04626
Residue:1255
BDBM50358455
NameBDBM50358455
Synonyms:CHEMBL1923010
TypeSmall organic molecule
Emp. Form.C23H20ClF3N4O3
Mol. Mass.492.878
SMILESOCCOCCn1ccc2ncnc(Nc3ccc(Oc4cccc(c4)C(F)(F)F)c(Cl)c3)c12