Reaction Details
TargetReceptor tyrosine-protein kinase erbB-2
LigandBDBM50358456
Substrate/Competitorn/a
Meas. Tech.ChEMBL_789674 (CHEMBL1924800)
IC50 11±n/a nM
Citation Ishikawa, TSeto, MBanno, HKawakita, YOorui, MTaniguchi, TOhta, YTamura, TNakayama, AMiki, HKamiguchi, HTanaka, THabuka, NSogabe, SYano, JAertgeerts, KKamiyama, K Design and synthesis of novel human epidermal growth factor receptor 2 (HER2)/epidermal growth factor receptor (EGFR) dual inhibitors bearing a pyrrolo[3,2-d]pyrimidine scaffold. J Med Chem54:8030-50 (2011) 
 
Receptor tyrosine-protein kinase erbB-2
Name:Receptor tyrosine-protein kinase erbB-2
Type:n/a
Mol. Mass.:137894.47
Organism:Homo sapiens (Human)
Description:P04626
Residue:1255
BDBM50358456
NameBDBM50358456
Synonyms:CHEMBL1614726
TypeSmall organic molecule
Emp. Form.C22H19ClF3N5O3
Mol. Mass.493.866
SMILESOCCOCCn1ccc2ncnc(Nc3cnc(Oc4cccc(c4)C(F)(F)F)c(Cl)c3)c12