Reaction Details
TargetRho-associated protein kinase 2
LigandBDBM50358487
Substrate/Competitorn/a
Meas. Tech.ChEMBL_789920 (CHEMBL1925273)
IC50 130±n/a nM
Citation Chowdhury, SSessions, EHPocas, JRGrant, WSchröter, TLin, LRuiz, CCameron, MDSchürer, SLoGrasso, PBannister, TDFeng, Y Discovery and optimization of indoles and 7-azaindoles as Rho kinase (ROCK) inhibitors (part-I). Bioorg Med Chem Lett21:7107-12 (2011) 
 
Rho-associated protein kinase 2
Name:Rho-associated protein kinase 2
Type:Protein
Mol. Mass.:160885.43
Organism:Homo sapiens (Human)
Description:O75116
Residue:1388
BDBM50358487
NameBDBM50358487
Synonyms:CHEMBL1923174
TypeSmall organic molecule
Emp. Form.C21H20N4O2
Mol. Mass.360.4091
SMILESCOc1cccc(c1)[C@H](C)NC(=O)c1c[nH]c2cc(ccc12)-c1cn[nH]c1