Reaction Details
TargetRho-associated protein kinase 2
LigandBDBM50358470
Substrate/Competitorn/a
Meas. Tech.ChEMBL_789920 (CHEMBL1925273)
IC50 160±n/a nM
Citation Chowdhury, SSessions, EHPocas, JRGrant, WSchröter, TLin, LRuiz, CCameron, MDSchürer, SLoGrasso, PBannister, TDFeng, Y Discovery and optimization of indoles and 7-azaindoles as Rho kinase (ROCK) inhibitors (part-I). Bioorg Med Chem Lett21:7107-12 (2011) 
 
Rho-associated protein kinase 2
Name:Rho-associated protein kinase 2
Type:Protein
Mol. Mass.:160885.43
Organism:Homo sapiens (Human)
Description:O75116
Residue:1388
BDBM50358470
NameBDBM50358470
Synonyms:CHEMBL1923052
TypeSmall organic molecule
Emp. Form.C22H19N3O2
Mol. Mass.357.4052
SMILESCOc1cccc(CNC(=O)c2cc3ccc(cc3[nH]2)-c2ccncc2)c1