Reaction Details
TargetRho-associated protein kinase 1
LigandBDBM50358476
Substrate/Competitorn/a
Meas. Tech.ChEMBL_789921 (CHEMBL1925274)
IC50 12±n/a nM
Citation Chowdhury, SSessions, EHPocas, JRGrant, WSchröter, TLin, LRuiz, CCameron, MDSchürer, SLoGrasso, PBannister, TDFeng, Y Discovery and optimization of indoles and 7-azaindoles as Rho kinase (ROCK) inhibitors (part-I). Bioorg Med Chem Lett21:7107-12 (2011) 
 
Rho-associated protein kinase 1
Name:Rho-associated protein kinase 1
Type:Serine/threonine-protein kinase
Mol. Mass.:158156.77
Organism:Homo sapiens (Human)
Description:Q13464
Residue:1354
BDBM50358476
NameBDBM50358476
Synonyms:CHEMBL1922034
TypeSmall organic molecule
Emp. Form.C19H17N5O2
Mol. Mass.347.3706
SMILESCOc1cccc(CNC(=O)c2cc3ccc(nc3[nH]2)-c2cn[nH]c2)c1