Reaction Details
TargetRho-associated protein kinase 1
LigandBDBM50358483
Substrate/Competitorn/a
Meas. Tech.ChEMBL_789921 (CHEMBL1925274)
IC50 1900±n/a nM
Citation Chowdhury, SSessions, EHPocas, JRGrant, WSchröter, TLin, LRuiz, CCameron, MDSchürer, SLoGrasso, PBannister, TDFeng, Y Discovery and optimization of indoles and 7-azaindoles as Rho kinase (ROCK) inhibitors (part-I). Bioorg Med Chem Lett21:7107-12 (2011) 
 
Rho-associated protein kinase 1
Name:Rho-associated protein kinase 1
Type:Serine/threonine-protein kinase
Mol. Mass.:158156.77
Organism:Homo sapiens (Human)
Description:Q13464
Residue:1354
BDBM50358483
NameBDBM50358483
Synonyms:CHEMBL1923170
TypeSmall organic molecule
Emp. Form.C20H18N4O2
Mol. Mass.346.3825
SMILESCOc1ccc(CNC(=O)c2c[nH]c3cc(ccc23)-c2cn[nH]c2)cc1